{"text_format":"1","workbook":"xlsx","n_sheets":2,"sheets":["Tabelle1","Invalidität"],"not_rendered":{"charts":1,"images":1,"macros":1,"external_links":0,"defined_names":1,"comments":0,"pivot_tables":0},"unopened":[],"bounds":{"document_bytes":16777216,"sheet_cells":100000,"rows_first":2000,"rows_last":500,"rows_between":2000,"halvings":0,"cell_chars":16384,"cell_head_chars":4096},"cells_cut":0,"cells_raw":0,"read":"whole","date_system":"1900"}

{"sheet":"Tabelle1","index":0,"n_rows":125,"n_cols":24,"rows_kept":125,"cut":false,"hidden":true,"merged":[]}
["Invaliditätsgrad","ohne Progression","Spitzenprogression","200 % Progression","225 % Progression","300 % Progression","350 % Progression","500 % Progression","1000 % Progression","Mehrleistung und Rente 5 ‰","Mehrleistung und Rente 10 %",null,"Invaliditätsgrad",{"$f":"IF($T$3>0,VLOOKUP($T$3,$V$2:$W$11,2,FALSE),\"\")","v":""},{"$f":"IF(T3>0,IF($T$4>9,\"zusätzliche Rentenleistung\",\"keine Rentenleistung\"),\"\")","v":""},{"$f":"IF(T7>0,VLOOKUP($T$7,$V$2:$W$11,2,FALSE),\"\")","v":""},null,null,"Auswahl",null,null,"Nr.","Staffel","Spalte"]
[0,0,0,0,0,0,0,0,0,0,0,null,0,{"$f":"IF(Invalidität!$I$14>$T$5,0,IF(AND($T$4=3,Invalidität!$I$14*(C2-A2*100)/100>200000),Invalidität!$I$14*M2+200000,Invalidität!$I$14*VLOOKUP(M2,$A$2:$K$102,$T$4,FALSE)/100))","v":{"$error":"#N/A"}},null,{"$f":"IF($T$10>$T$12,0,IF(AND($T$8=3,$T$10*(C2-A2*100)/100>200000),$T$10*M2+200000,$T$10*VLOOKUP(M2,$A$2:$K$102,$T$8,FALSE)/100))","v":{"$error":"#N/A"}},null,null,"Altersgruppe",{"$f":"Invalidität!$H$11","v":0},null,1,{"$f":"IF($T$2>0,B1,\"\")","v":""},{"$f":"IF($T$2>0,2,\"\")","v":""}]
[0.01,1,1,1,1,1,1,1,1,1,1,null,0.01,{"$f":"IF(Invalidität!$I$14>$T$5,0,IF(AND($T$4=3,Invalidität!$I$14*(C3-A3*100)/100>200000),Invalidität!$I$14*M3+200000,Invalidität!$I$14*VLOOKUP(M3,$A$2:$K$102,$T$4,FALSE)/100))","v":{"$error":"#N/A"}},null,{"$f":"IF($T$10>$T$12,0,IF(AND($T$8=3,$T$10*(C3-A3*100)/100>200000),$T$10*M3+200000,$T$10*VLOOKUP(M3,$A$2:$K$102,$T$8,FALSE)/100))","v":{"$error":"#N/A"}},null,null,"Progression",{"$f":"Invalidität!$H$21","v":0},null,2,{"$f":"IF($T$2>0,IF($T$2=3,K1,C1),\"\")","v":""},{"$f":"IF($T$2>0,IF($T$2=3,11,3),\"\")","v":""}]
[0.02,2,2,2,2,2,2,2,2,2,2,null,0.02,{"$f":"IF(Invalidität!$I$14>$T$5,0,IF(AND($T$4=3,Invalidität!$I$14*(C4-A4*100)/100>200000),Invalidität!$I$14*M4+200000,Invalidität!$I$14*VLOOKUP(M4,$A$2:$K$102,$T$4,FALSE)/100))","v":{"$error":"#N/A"}},null,{"$error":"#N/A"},null,null,"Prog-Spalte",{"$f":"VLOOKUP(T3,$V$2:$X$11,3,FALSE)","v":{"$error":"#N/A"}},null,3,{"$f":"IF($T$2>0,IF($T$2=3,\"\",D1),\"\")","v":""},{"$f":"IF($T$2>0,IF($T$2=3,\"\",4),\"\")","v":""}]
[0.03,3,3,3,3,3,3,3,3,3,3,null,0.03,{"$f":"IF(Invalidität!$I$14>$T$5,0,IF(AND($T$4=3,Invalidität!$I$14*(C5-A5*100)/100>200000),Invalidität!$I$14*M5+200000,Invalidität!$I$14*VLOOKUP(M5,$A$2:$K$102,$T$4,FALSE)/100))","v":{"$error":"#N/A"}},null,{"$error":"#N/A"},null,null,"Höchst-Vsu",{"$f":"VLOOKUP($T$2,$A$108:$K$110,VLOOKUP(T3,$V$2:$X$11,3,FALSE),FALSE)","v":{"$error":"#N/A"}},null,4,{"$f":"IF($T$2>0,IF($T$2=3,\"\",E1),\"\")","v":""},{"$f":"IF($T$2>0,IF($T$2=3,\"\",5),\"\")","v":""}]
[0.04,4,4,4,4,4,4,4,4,4,4,null,0.04,{"$f":"IF(Invalidität!$I$14>$T$5,0,IF(AND($T$4=3,Invalidität!$I$14*(C6-A6*100)/100>200000),Invalidität!$I$14*M6+200000,Invalidität!$I$14*VLOOKUP(M6,$A$2:$K$102,$T$4,FALSE)/100))","v":{"$error":"#N/A"}},null,{"$error":"#N/A"},null,null,"Voll-Inva",{"$f":"IF(AND($T$4=3,Invalidität!$I$14>200000),Invalidität!$I$14+200000,Invalidität!$I$14*VLOOKUP(\"Faktor\",$A$103:$K$103,$T$4,))","v":{"$error":"#N/A"}},null,5,{"$f":"IF($T$2>0,IF($T$2=3,\"\",F1),\"\")","v":""},{"$f":"IF($T$2>0,IF($T$2=3,\"\",6),\"\"\"\")","v":"\""}]
[0.05,5,5,5,5,5,5,5,5,5,5,null,0.05,{"$f":"IF(Invalidität!$I$14>$T$5,0,IF(AND($T$4=3,Invalidität!$I$14*(C7-A7*100)/100>200000),Invalidität!$I$14*M7+200000,Invalidität!$I$14*VLOOKUP(M7,$A$2:$K$102,$T$4,FALSE)/100))","v":{"$error":"#N/A"}},null,{"$error":"#N/A"},null,null,"AltProg",{"$f":"Invalidität!$H$24","v":0},null,6,{"$f":"IF($T$2>0,IF($T$2=3,\"\",G1),\"\")","v":""},{"$f":"IF($T$2>0,IF($T$2=3,\"\",7),\"\"\"\")","v":"\""}]
[0.06,6,6,6,6,6,6,6,6,6,6,null,0.06,{"$f":"IF(Invalidität!$I$14>$T$5,0,IF(AND($T$4=3,Invalidität!$I$14*(C8-A8*100)/100>200000),Invalidität!$I$14*M8+200000,Invalidität!$I$14*VLOOKUP(M8,$A$2:$K$102,$T$4,FALSE)/100))","v":{"$error":"#N/A"}},null,{"$error":"#N/A"},null,null,"AltProgSpalte",{"$f":"IF(T7>0,VLOOKUP(T7,$V$2:$X$11,3,FALSE),\"\")","v":""},null,7,{"$f":"IF($T$2>0,IF($T$2=3,\"\",H1),\"\")","v":""},{"$f":"IF($T$2>0,IF($T$2=3,\"\",8),\"\"\"\")","v":"\""}]
[7.0000000000000007E-2,7,7,7,7,7,7,7,7,7,7,null,7.0000000000000007E-2,{"$f":"IF(Invalidität!$I$14>$T$5,0,IF(AND($T$4=3,Invalidität!$I$14*(C9-A9*100)/100>200000),Invalidität!$I$14*M9+200000,Invalidität!$I$14*VLOOKUP(M9,$A$2:$K$102,$T$4,FALSE)/100))","v":{"$error":"#N/A"}},null,{"$error":"#N/A"},null,null,"AltBerechnung",{"$f":"Invalidität!$H$27","v":0},"gleiche Höchstleistung",8,{"$f":"IF($T$2>0,IF($T$2=3,\"\",I1),\"\")","v":""},{"$f":"IF($T$2>0,IF($T$2=3,\"\",9),\"\"\"\")","v":"\""}]
[0.08,8,8,8,8,8,8,8,8,8,8,null,0.08,{"$f":"IF(Invalidität!$I$14>$T$5,0,IF(AND($T$4=3,Invalidität!$I$14*(C10-A10*100)/100>200000),Invalidität!$I$14*M10+200000,Invalidität!$I$14*VLOOKUP(M10,$A$2:$K$102,$T$4,FALSE)/100))","v":{"$error":"#N/A"}},null,{"$error":"#N/A"},null,null,"AltInvalidität",{"$f":"IF(T9=1,IF(T4<10,IF(AND(T7=2,T6>400000),T6-200000,ROUND(T6/VLOOKUP(\"Faktor\",A103:K103,T8,FALSE),-3)),ROUND(Invalidität!I14/VLOOKUP(\"Faktor\",A103:K103,T8,FALSE),-3)),Invalidität!I14)","v":0},"gleiche Grund-Invalidität",9,{"$f":"IF($T$2>0,IF($T$2=3,\"\",J1),\"\")","v":""},{"$f":"IF($T$2>0,IF($T$2=3,\"\",10),\"\"\"\")","v":"\""}]
[0.09,9,9,9,9,9,9,9,9,9,9,null,0.09,{"$f":"IF(Invalidität!$I$14>$T$5,0,IF(AND($T$4=3,Invalidität!$I$14*(C11-A11*100)/100>200000),Invalidität!$I$14*M11+200000,Invalidität!$I$14*VLOOKUP(M11,$A$2:$K$102,$T$4,FALSE)/100))","v":{"$error":"#N/A"}},null,{"$error":"#N/A"},null,null,"AltVollinva",{"$f":"IF(AND($T$8=3,T10>200000),T10+200000,T10*VLOOKUP(\"Faktor\",$A$103:$K$103,$T$8))","v":{"$error":"#REF!"}},null,10,{"$f":"IF($T$2>0,IF($T$2=3,\"\",K1),\"\")","v":""},{"$f":"IF($T$2>0,IF($T$2=3,\"\",11),\"\"\"\")","v":"\""}]
[0.1,10,10,10,10,10,10,10,10,10,10,null,0.1,{"$f":"IF(Invalidität!$I$14>$T$5,0,IF(AND($T$4=3,Invalidität!$I$14*(C12-A12*100)/100>200000),Invalidität!$I$14*M12+200000,Invalidität!$I$14*VLOOKUP(M12,$A$2:$K$102,$T$4,FALSE)/100))","v":{"$error":"#N/A"}},null,{"$error":"#N/A"},null,null,"AltHöchstVsu",{"$f":"VLOOKUP($T$2,$A$108:$K$110,VLOOKUP(T7,$V$1:$X$11,3,FALSE),FALSE)","v":{"$error":"#N/A"}}]
[0.11,11,11,11,11,11,11,11,11,11,11,null,0.11,{"$f":"IF(Invalidität!$I$14>$T$5,0,IF(AND($T$4=3,Invalidität!$I$14*(C13-A13*100)/100>200000),Invalidität!$I$14*M13+200000,Invalidität!$I$14*VLOOKUP(M13,$A$2:$K$102,$T$4,FALSE)/100))","v":{"$error":"#N/A"}},null,{"$error":"#N/A"}]
[0.12,12,12,12,12,12,12,12,12,12,12,null,0.12,{"$f":"IF(Invalidität!$I$14>$T$5,0,IF(AND($T$4=3,Invalidität!$I$14*(C14-A14*100)/100>200000),Invalidität!$I$14*M14+200000,Invalidität!$I$14*VLOOKUP(M14,$A$2:$K$102,$T$4,FALSE)/100))","v":{"$error":"#N/A"}},null,{"$error":"#N/A"}]
[0.13,13,13,13,13,13,13,13,13,13,13,null,0.13,{"$f":"IF(Invalidität!$I$14>$T$5,0,IF(AND($T$4=3,Invalidität!$I$14*(C15-A15*100)/100>200000),Invalidität!$I$14*M15+200000,Invalidität!$I$14*VLOOKUP(M15,$A$2:$K$102,$T$4,FALSE)/100))","v":{"$error":"#N/A"}},null,{"$error":"#N/A"}]
[0.14000000000000001,14,14,14,14,14,14,14,14,14,14,null,0.14000000000000001,{"$f":"IF(Invalidität!$I$14>$T$5,0,IF(AND($T$4=3,Invalidität!$I$14*(C16-A16*100)/100>200000),Invalidität!$I$14*M16+200000,Invalidität!$I$14*VLOOKUP(M16,$A$2:$K$102,$T$4,FALSE)/100))","v":{"$error":"#N/A"}},null,{"$error":"#N/A"}]
[0.15,15,15,15,15,15,15,15,15,15,15,null,0.15,{"$f":"IF(Invalidität!$I$14>$T$5,0,IF(AND($T$4=3,Invalidität!$I$14*(C17-A17*100)/100>200000),Invalidität!$I$14*M17+200000,Invalidität!$I$14*VLOOKUP(M17,$A$2:$K$102,$T$4,FALSE)/100))","v":{"$error":"#N/A"}},null,{"$error":"#N/A"}]
[0.16,16,16,16,16,16,16,16,16,16,16,null,0.16,{"$f":"IF(Invalidität!$I$14>$T$5,0,IF(AND($T$4=3,Invalidität!$I$14*(C18-A18*100)/100>200000),Invalidität!$I$14*M18+200000,Invalidität!$I$14*VLOOKUP(M18,$A$2:$K$102,$T$4,FALSE)/100))","v":{"$error":"#N/A"}},null,{"$error":"#N/A"}]
[0.17,17,17,17,17,17,17,17,17,17,17,null,0.17,{"$f":"IF(Invalidität!$I$14>$T$5,0,IF(AND($T$4=3,Invalidität!$I$14*(C19-A19*100)/100>200000),Invalidität!$I$14*M19+200000,Invalidität!$I$14*VLOOKUP(M19,$A$2:$K$102,$T$4,FALSE)/100))","v":{"$error":"#N/A"}},null,{"$error":"#N/A"}]
[0.18,18,18,18,18,18,18,18,18,18,18,null,0.18,{"$f":"IF(Invalidität!$I$14>$T$5,0,IF(AND($T$4=3,Invalidität!$I$14*(C20-A20*100)/100>200000),Invalidität!$I$14*M20+200000,Invalidität!$I$14*VLOOKUP(M20,$A$2:$K$102,$T$4,FALSE)/100))","v":{"$error":"#N/A"}},null,{"$error":"#N/A"}]
[0.19,19,19,19,19,19,19,19,19,19,19,null,0.19,{"$f":"IF(Invalidität!$I$14>$T$5,0,IF(AND($T$4=3,Invalidität!$I$14*(C21-A21*100)/100>200000),Invalidität!$I$14*M21+200000,Invalidität!$I$14*VLOOKUP(M21,$A$2:$K$102,$T$4,FALSE)/100))","v":{"$error":"#N/A"}},null,{"$error":"#N/A"}]
[0.2,20,20,20,20,20,20,20,20,20,20,null,0.2,{"$f":"IF(Invalidität!$I$14>$T$5,0,IF(AND($T$4=3,Invalidität!$I$14*(C22-A22*100)/100>200000),Invalidität!$I$14*M22+200000,Invalidität!$I$14*VLOOKUP(M22,$A$2:$K$102,$T$4,FALSE)/100))","v":{"$error":"#N/A"}},null,{"$error":"#N/A"}]
[0.21,21,21,21,21,21,21,21,21,21,21,null,0.21,{"$f":"IF(Invalidität!$I$14>$T$5,0,IF(AND($T$4=3,Invalidität!$I$14*(C23-A23*100)/100>200000),Invalidität!$I$14*M23+200000,Invalidität!$I$14*VLOOKUP(M23,$A$2:$K$102,$T$4,FALSE)/100))","v":{"$error":"#N/A"}},null,{"$error":"#N/A"}]
[0.22,22,22,22,22,22,22,22,22,22,22,null,0.22,{"$f":"IF(Invalidität!$I$14>$T$5,0,IF(AND($T$4=3,Invalidität!$I$14*(C24-A24*100)/100>200000),Invalidität!$I$14*M24+200000,Invalidität!$I$14*VLOOKUP(M24,$A$2:$K$102,$T$4,FALSE)/100))","v":{"$error":"#N/A"}},null,{"$error":"#N/A"}]
[0.23,23,23,23,23,23,23,23,23,23,23,null,0.23,{"$f":"IF(Invalidität!$I$14>$T$5,0,IF(AND($T$4=3,Invalidität!$I$14*(C25-A25*100)/100>200000),Invalidität!$I$14*M25+200000,Invalidität!$I$14*VLOOKUP(M25,$A$2:$K$102,$T$4,FALSE)/100))","v":{"$error":"#N/A"}},null,{"$error":"#N/A"}]
[0.24,24,24,24,24,24,24,24,24,24,24,null,0.24,{"$f":"IF(Invalidität!$I$14>$T$5,0,IF(AND($T$4=3,Invalidität!$I$14*(C26-A26*100)/100>200000),Invalidität!$I$14*M26+200000,Invalidität!$I$14*VLOOKUP(M26,$A$2:$K$102,$T$4,FALSE)/100))","v":{"$error":"#N/A"}},null,{"$error":"#N/A"}]
[0.25,25,25,25,25,25,25,25,25,25,25,null,0.25,{"$f":"IF(Invalidität!$I$14>$T$5,0,IF(AND($T$4=3,Invalidität!$I$14*(C27-A27*100)/100>200000),Invalidität!$I$14*M27+200000,Invalidität!$I$14*VLOOKUP(M27,$A$2:$K$102,$T$4,FALSE)/100))","v":{"$error":"#N/A"}},null,{"$error":"#N/A"}]
[0.26,26,26,27,27,28,28,28,30,28,28,null,0.26,{"$f":"IF(Invalidität!$I$14>$T$5,0,IF(AND($T$4=3,Invalidität!$I$14*(C28-A28*100)/100>200000),Invalidität!$I$14*M28+200000,Invalidität!$I$14*VLOOKUP(M28,$A$2:$K$102,$T$4,FALSE)/100))","v":{"$error":"#N/A"}},null,{"$error":"#N/A"}]
[0.27,27,27,29,29,31,31,31,35,31,31,null,0.27,{"$f":"IF(Invalidität!$I$14>$T$5,0,IF(AND($T$4=3,Invalidität!$I$14*(C29-A29*100)/100>200000),Invalidität!$I$14*M29+200000,Invalidität!$I$14*VLOOKUP(M29,$A$2:$K$102,$T$4,FALSE)/100))","v":{"$error":"#N/A"}},null,{"$error":"#N/A"}]
[0.28000000000000003,28,28,31,31,34,34,34,40,34,34,null,0.28000000000000003,{"$f":"IF(Invalidität!$I$14>$T$5,0,IF(AND($T$4=3,Invalidität!$I$14*(C30-A30*100)/100>200000),Invalidität!$I$14*M30+200000,Invalidität!$I$14*VLOOKUP(M30,$A$2:$K$102,$T$4,FALSE)/100))","v":{"$error":"#N/A"}},null,{"$error":"#N/A"}]
[0.28999999999999998,29,29,33,33,37,37,37,45,37,37,null,0.28999999999999998,{"$f":"IF(Invalidität!$I$14>$T$5,0,IF(AND($T$4=3,Invalidität!$I$14*(C31-A31*100)/100>200000),Invalidität!$I$14*M31+200000,Invalidität!$I$14*VLOOKUP(M31,$A$2:$K$102,$T$4,FALSE)/100))","v":{"$error":"#N/A"}},null,{"$error":"#N/A"}]
[0.3,30,30,35,35,40,40,40,50,40,40,null,0.3,{"$f":"IF(Invalidität!$I$14>$T$5,0,IF(AND($T$4=3,Invalidität!$I$14*(C32-A32*100)/100>200000),Invalidität!$I$14*M32+200000,Invalidität!$I$14*VLOOKUP(M32,$A$2:$K$102,$T$4,FALSE)/100))","v":{"$error":"#N/A"}},null,{"$error":"#N/A"}]
[0.31,31,31,37,37,43,43,43,55,43,43,null,0.31,{"$f":"IF(Invalidität!$I$14>$T$5,0,IF(AND($T$4=3,Invalidität!$I$14*(C33-A33*100)/100>200000),Invalidität!$I$14*M33+200000,Invalidität!$I$14*VLOOKUP(M33,$A$2:$K$102,$T$4,FALSE)/100))","v":{"$error":"#N/A"}},null,{"$error":"#N/A"}]
[0.32,32,32,39,39,46,46,46,60,46,46,null,0.32,{"$f":"IF(Invalidität!$I$14>$T$5,0,IF(AND($T$4=3,Invalidität!$I$14*(C34-A34*100)/100>200000),Invalidität!$I$14*M34+200000,Invalidität!$I$14*VLOOKUP(M34,$A$2:$K$102,$T$4,FALSE)/100))","v":{"$error":"#N/A"}},null,{"$error":"#N/A"}]
[0.33,33,33,41,41,49,49,49,65,49,49,null,0.33,{"$f":"IF(Invalidität!$I$14>$T$5,0,IF(AND($T$4=3,Invalidität!$I$14*(C35-A35*100)/100>200000),Invalidität!$I$14*M35+200000,Invalidität!$I$14*VLOOKUP(M35,$A$2:$K$102,$T$4,FALSE)/100))","v":{"$error":"#N/A"}},null,{"$error":"#N/A"}]
[0.34,34,34,43,43,52,52,52,70,52,52,null,0.34,{"$f":"IF(Invalidität!$I$14>$T$5,0,IF(AND($T$4=3,Invalidität!$I$14*(C36-A36*100)/100>200000),Invalidität!$I$14*M36+200000,Invalidität!$I$14*VLOOKUP(M36,$A$2:$K$102,$T$4,FALSE)/100))","v":{"$error":"#N/A"}},null,{"$error":"#N/A"}]
[0.35,35,35,45,45,55,55,55,75,55,55,null,0.35,{"$f":"IF(Invalidität!$I$14>$T$5,0,IF(AND($T$4=3,Invalidität!$I$14*(C37-A37*100)/100>200000),Invalidität!$I$14*M37+200000,Invalidität!$I$14*VLOOKUP(M37,$A$2:$K$102,$T$4,FALSE)/100))","v":{"$error":"#N/A"}},null,{"$error":"#N/A"}]
[0.36,36,36,47,47,58,58,58,80,58,58,null,0.36,{"$f":"IF(Invalidität!$I$14>$T$5,0,IF(AND($T$4=3,Invalidität!$I$14*(C38-A38*100)/100>200000),Invalidität!$I$14*M38+200000,Invalidität!$I$14*VLOOKUP(M38,$A$2:$K$102,$T$4,FALSE)/100))","v":{"$error":"#N/A"}},null,{"$error":"#N/A"}]
[0.37,37,37,49,49,61,61,61,85,61,61,null,0.37,{"$f":"IF(Invalidität!$I$14>$T$5,0,IF(AND($T$4=3,Invalidität!$I$14*(C39-A39*100)/100>200000),Invalidität!$I$14*M39+200000,Invalidität!$I$14*VLOOKUP(M39,$A$2:$K$102,$T$4,FALSE)/100))","v":{"$error":"#N/A"}},null,{"$error":"#N/A"}]
[0.38,38,38,51,51,64,64,64,90,64,64,null,0.38,{"$f":"IF(Invalidität!$I$14>$T$5,0,IF(AND($T$4=3,Invalidität!$I$14*(C40-A40*100)/100>200000),Invalidität!$I$14*M40+200000,Invalidität!$I$14*VLOOKUP(M40,$A$2:$K$102,$T$4,FALSE)/100))","v":{"$error":"#N/A"}},null,{"$error":"#N/A"}]
[0.39,39,39,53,53,67,67,67,95,67,67,null,0.39,{"$f":"IF(Invalidität!$I$14>$T$5,0,IF(AND($T$4=3,Invalidität!$I$14*(C41-A41*100)/100>200000),Invalidität!$I$14*M41+200000,Invalidität!$I$14*VLOOKUP(M41,$A$2:$K$102,$T$4,FALSE)/100))","v":{"$error":"#N/A"}},null,{"$error":"#N/A"}]
[0.4,40,40,55,55,70,70,70,100,70,70,null,0.4,{"$f":"IF(Invalidität!$I$14>$T$5,0,IF(AND($T$4=3,Invalidität!$I$14*(C42-A42*100)/100>200000),Invalidität!$I$14*M42+200000,Invalidität!$I$14*VLOOKUP(M42,$A$2:$K$102,$T$4,FALSE)/100))","v":{"$error":"#N/A"}},null,{"$error":"#N/A"}]
[0.41,41,41,57,57,73,73,73,105,73,73,null,0.41,{"$f":"IF(Invalidität!$I$14>$T$5,0,IF(AND($T$4=3,Invalidität!$I$14*(C43-A43*100)/100>200000),Invalidität!$I$14*M43+200000,Invalidität!$I$14*VLOOKUP(M43,$A$2:$K$102,$T$4,FALSE)/100))","v":{"$error":"#N/A"}},null,{"$error":"#N/A"}]
[0.42,42,42,59,59,76,76,76,110,76,76,null,0.42,{"$f":"IF(Invalidität!$I$14>$T$5,0,IF(AND($T$4=3,Invalidität!$I$14*(C44-A44*100)/100>200000),Invalidität!$I$14*M44+200000,Invalidität!$I$14*VLOOKUP(M44,$A$2:$K$102,$T$4,FALSE)/100))","v":{"$error":"#N/A"}},null,{"$error":"#N/A"}]
[0.43,43,43,61,61,79,79,79,115,79,79,null,0.43,{"$f":"IF(Invalidität!$I$14>$T$5,0,IF(AND($T$4=3,Invalidität!$I$14*(C45-A45*100)/100>200000),Invalidität!$I$14*M45+200000,Invalidität!$I$14*VLOOKUP(M45,$A$2:$K$102,$T$4,FALSE)/100))","v":{"$error":"#N/A"}},null,{"$error":"#N/A"}]
[0.44,44,44,63,63,82,82,82,120,82,82,null,0.44,{"$f":"IF(Invalidität!$I$14>$T$5,0,IF(AND($T$4=3,Invalidität!$I$14*(C46-A46*100)/100>200000),Invalidität!$I$14*M46+200000,Invalidität!$I$14*VLOOKUP(M46,$A$2:$K$102,$T$4,FALSE)/100))","v":{"$error":"#N/A"}},null,{"$error":"#N/A"}]
[0.45,45,45,65,65,85,85,85,125,85,85,null,0.45,{"$f":"IF(Invalidität!$I$14>$T$5,0,IF(AND($T$4=3,Invalidität!$I$14*(C47-A47*100)/100>200000),Invalidität!$I$14*M47+200000,Invalidität!$I$14*VLOOKUP(M47,$A$2:$K$102,$T$4,FALSE)/100))","v":{"$error":"#N/A"}},null,{"$error":"#N/A"}]
[0.46,46,46,67,67,88,88,88,130,88,88,null,0.46,{"$f":"IF(Invalidität!$I$14>$T$5,0,IF(AND($T$4=3,Invalidität!$I$14*(C48-A48*100)/100>200000),Invalidität!$I$14*M48+200000,Invalidität!$I$14*VLOOKUP(M48,$A$2:$K$102,$T$4,FALSE)/100))","v":{"$error":"#N/A"}},null,{"$error":"#N/A"}]
[0.47,47,47,69,69,91,91,91,135,91,91,null,0.47,{"$f":"IF(Invalidität!$I$14>$T$5,0,IF(AND($T$4=3,Invalidität!$I$14*(C49-A49*100)/100>200000),Invalidität!$I$14*M49+200000,Invalidität!$I$14*VLOOKUP(M49,$A$2:$K$102,$T$4,FALSE)/100))","v":{"$error":"#N/A"}},null,{"$error":"#N/A"}]
[0.48,48,48,71,71,94,94,94,140,94,94,null,0.48,{"$f":"IF(Invalidität!$I$14>$T$5,0,IF(AND($T$4=3,Invalidität!$I$14*(C50-A50*100)/100>200000),Invalidität!$I$14*M50+200000,Invalidität!$I$14*VLOOKUP(M50,$A$2:$K$102,$T$4,FALSE)/100))","v":{"$error":"#N/A"}},null,{"$error":"#N/A"}]
[0.49,49,49,73,73,97,97,97,145,97,97,null,0.49,{"$f":"IF(Invalidität!$I$14>$T$5,0,IF(AND($T$4=3,Invalidität!$I$14*(C51-A51*100)/100>200000),Invalidität!$I$14*M51+200000,Invalidität!$I$14*VLOOKUP(M51,$A$2:$K$102,$T$4,FALSE)/100))","v":{"$error":"#N/A"}},null,{"$error":"#N/A"}]
[0.5,50,50,75,75,100,100,100,150,100,100,null,0.5,{"$f":"IF(Invalidität!$I$14>$T$5,0,IF(AND($T$4=3,Invalidität!$I$14*(C52-A52*100)/100>200000),Invalidität!$I$14*M52+200000,Invalidität!$I$14*VLOOKUP(M52,$A$2:$K$102,$T$4,FALSE)/100))","v":{"$error":"#N/A"}},{"$f":"IF(Invalidität!$I$14>Tabelle1!$T$5,0,IF($T$4=10,N52*0.005,IF($T$4=11,N52*0.1,\"\")))","v":{"$error":"#N/A"}},{"$error":"#N/A"}]
[0.51,51,51,77,78,104,105,108,160,100,100,null,0.51,{"$f":"IF(Invalidität!$I$14>$T$5,0,IF(AND($T$4=3,Invalidität!$I$14*(C53-A53*100)/100>200000),Invalidität!$I$14*M53+200000,Invalidität!$I$14*VLOOKUP(M53,$A$2:$K$102,$T$4,FALSE)/100))","v":{"$error":"#N/A"}},{"$f":"IF(Invalidität!$I$14>Tabelle1!$T$5,0,IF($T$4=10,N53*0.005,IF($T$4=11,N53*0.1,\"\")))","v":{"$error":"#N/A"}},{"$error":"#N/A"}]
[0.52,52,52,79,81,108,110,116,170,100,100,null,0.52,{"$f":"IF(Invalidität!$I$14>$T$5,0,IF(AND($T$4=3,Invalidität!$I$14*(C54-A54*100)/100>200000),Invalidität!$I$14*M54+200000,Invalidität!$I$14*VLOOKUP(M54,$A$2:$K$102,$T$4,FALSE)/100))","v":{"$error":"#N/A"}},{"$f":"IF(Invalidität!$I$14>Tabelle1!$T$5,0,IF($T$4=10,N54*0.005,IF($T$4=11,N54*0.1,\"\")))","v":{"$error":"#N/A"}},{"$error":"#N/A"}]
[0.53,53,53,81,84,112,115,124,180,100,100,null,0.53,{"$f":"IF(Invalidität!$I$14>$T$5,0,IF(AND($T$4=3,Invalidität!$I$14*(C55-A55*100)/100>200000),Invalidität!$I$14*M55+200000,Invalidität!$I$14*VLOOKUP(M55,$A$2:$K$102,$T$4,FALSE)/100))","v":{"$error":"#N/A"}},{"$f":"IF(Invalidität!$I$14>Tabelle1!$T$5,0,IF($T$4=10,N55*0.005,IF($T$4=11,N55*0.1,\"\")))","v":{"$error":"#N/A"}},{"$error":"#N/A"}]
[0.54,54,54,83,87,116,120,132,190,100,100,null,0.54,{"$f":"IF(Invalidität!$I$14>$T$5,0,IF(AND($T$4=3,Invalidität!$I$14*(C56-A56*100)/100>200000),Invalidität!$I$14*M56+200000,Invalidität!$I$14*VLOOKUP(M56,$A$2:$K$102,$T$4,FALSE)/100))","v":{"$error":"#N/A"}},{"$f":"IF(Invalidität!$I$14>Tabelle1!$T$5,0,IF($T$4=10,N56*0.005,IF($T$4=11,N56*0.1,\"\")))","v":{"$error":"#N/A"}},{"$error":"#N/A"}]
[0.55000000000000004,55,55,85,90,120,125,140,200,100,100,null,0.55000000000000004,{"$f":"IF(Invalidität!$I$14>$T$5,0,IF(AND($T$4=3,Invalidität!$I$14*(C57-A57*100)/100>200000),Invalidität!$I$14*M57+200000,Invalidität!$I$14*VLOOKUP(M57,$A$2:$K$102,$T$4,FALSE)/100))","v":{"$error":"#N/A"}},{"$f":"IF(Invalidität!$I$14>Tabelle1!$T$5,0,IF($T$4=10,N57*0.005,IF($T$4=11,N57*0.1,\"\")))","v":{"$error":"#N/A"}},{"$error":"#N/A"}]
[0.56000000000000005,56,56,87,93,124,130,148,210,100,100,null,0.56000000000000005,{"$f":"IF(Invalidität!$I$14>$T$5,0,IF(AND($T$4=3,Invalidität!$I$14*(C58-A58*100)/100>200000),Invalidität!$I$14*M58+200000,Invalidität!$I$14*VLOOKUP(M58,$A$2:$K$102,$T$4,FALSE)/100))","v":{"$error":"#N/A"}},{"$f":"IF(Invalidität!$I$14>Tabelle1!$T$5,0,IF($T$4=10,N58*0.005,IF($T$4=11,N58*0.1,\"\")))","v":{"$error":"#N/A"}},{"$error":"#N/A"}]
[0.56999999999999995,57,57,89,96,128,135,156,220,100,100,null,0.56999999999999995,{"$f":"IF(Invalidität!$I$14>$T$5,0,IF(AND($T$4=3,Invalidität!$I$14*(C59-A59*100)/100>200000),Invalidität!$I$14*M59+200000,Invalidität!$I$14*VLOOKUP(M59,$A$2:$K$102,$T$4,FALSE)/100))","v":{"$error":"#N/A"}},{"$f":"IF(Invalidität!$I$14>Tabelle1!$T$5,0,IF($T$4=10,N59*0.005,IF($T$4=11,N59*0.1,\"\")))","v":{"$error":"#N/A"}},{"$error":"#N/A"}]
[0.57999999999999996,58,58,91,99,132,140,164,230,100,100,null,0.57999999999999996,{"$f":"IF(Invalidität!$I$14>$T$5,0,IF(AND($T$4=3,Invalidität!$I$14*(C60-A60*100)/100>200000),Invalidität!$I$14*M60+200000,Invalidität!$I$14*VLOOKUP(M60,$A$2:$K$102,$T$4,FALSE)/100))","v":{"$error":"#N/A"}},{"$f":"IF(Invalidität!$I$14>Tabelle1!$T$5,0,IF($T$4=10,N60*0.005,IF($T$4=11,N60*0.1,\"\")))","v":{"$error":"#N/A"}},{"$error":"#N/A"}]
{"$rows_left_out":66}
{"sheet":"Invalidität","index":1,"n_rows":42,"n_cols":9,"rows_kept":42,"cut":false,"hidden":false,"merged":[[6,1,7,5],[15,8,18,10],[32,1,33,4]]}
[]
[]
[]
[]
[]
[]
[]
[]
[]
[null,null,null,null,null,null,null,null,"Altersgruppe"]
[null,null,null,null,null,null,null,null,{"$f":"VLOOKUP(H11,Tabelle1!A105:B107,2,FALSE)","v":{"$error":"#N/A"}}]
[]
[null,null,null,null,null,null,null,null,"Invaliditätssumme:"]
[]
[]
[null,null,null,null,null,null,null,null,{"$f":"IF(ISBLANK(I14),\"\",IF(I14>Tabelle1!$T$5,CONCATENATE(\"Die Höchstversicherungssumme von \",TEXT(Tabelle1!$T$5,\"#.##0\"),\" Euro ist überschritten. Bitte Summe korrigieren.\"),IF(Tabelle1!$T$4<10,CONCATENATE(\"Leistung bei Vollinvalidität \",TEXT(Tabelle1!$T$6,\"#.##0\"),\" Euro\"),CONCATENATE(\"monatliche Rentenleistung \",TEXT(Tabelle1!$T$6,\"#.##0\"),\" Euro\"))))","v":""}]
[]
[]
[]
[null,null,null,null,null,null,null,null,"Progression"]
[null,null,null,null,null,null,null,null,{"$f":"VLOOKUP(H21,Tabelle1!V2:W11,2,FALSE)","v":{"$error":"#N/A"}}]
[]
[null,null,null,null,null,null,null,null,{"$f":"IF(Tabelle1!T2<3,\"Alternative Progression\",\"\")","v":"Alternative Progression"}]
[null,null,null,null,null,null,null,null,{"$f":"VLOOKUP(H24,Tabelle1!V2:W9,2,FALSE)","v":{"$error":"#N/A"}}]
[]
[null,null,null,null,null,null,null,null,{"$f":"IF(Tabelle1!T2<3,\"Basis\",\"\")","v":"Basis"}]
[null,null,null,null,null,null,null,null,{"$f":"IF(H27=1,\"gleiche Höchstleistung\",IF(H27=2,\"gleiche Grund-Invalidität\",\"\"))","v":""}]
[]
[null,null,null,null,null,null,null,null,{"$f":"IF(Tabelle1!T9>0,\"Alternative Invaliditätssumme\",\"\")","v":""}]
[null,null,null,null,null,null,null,null,{"$f":"IF(Tabelle1!T9>0,Tabelle1!T10,\"\")","v":""}]
[null,null,null,null,null,null,null,null,{"$f":"IF(Tabelle1!T9>0,IF(I30>Tabelle1!T12,CONCATENATE(\"Die Höchstversicherungssumme von \",TEXT(Tabelle1!T12,\"#.##0\"),\" Euro ist überschritten. Bitte andere Progression wählen.\"),IF(Tabelle1!T8<10,CONCATENATE(\"Leistung bei Vollinvalidität \",TEXT(Tabelle1!T11,\"#.##0\"),\" Euro\"),CONCATENATE(\"monatliche Rentenleistung \",TEXT(Tabelle1!T11,\"#.##0\"),\" Euro\"))),\"\")","v":""}]
[]
[null,{"$f":"IF(Tabelle1!$T$3>0,HLOOKUP(Tabelle1!$T$3,Tabelle1!$B$112:$K$125,2),\"\")","v":""}]
[]
[null,{"$f":"IF(Tabelle1!$T$3>0,HLOOKUP(Tabelle1!$T$3,Tabelle1!$B$112:$K$125,3),\"\")","v":""}]
[null,{"$f":"IF(Tabelle1!$T$3>0,HLOOKUP(Tabelle1!$T$3,Tabelle1!$B$112:$K$125,4),\"\")","v":""}]
[null,{"$f":"IF(Tabelle1!$T$3>0,HLOOKUP(Tabelle1!$T$3,Tabelle1!$B$112:$K$125,5),\"\")","v":""}]
[null,{"$f":"IF(Tabelle1!$T$3>0,HLOOKUP(Tabelle1!$T$3,Tabelle1!$B$112:$K$125,6),\"\")","v":""}]
[null,{"$f":"IF(Tabelle1!$T$3>0,HLOOKUP(Tabelle1!$T$3,Tabelle1!$B$112:$K$125,7),\"\")","v":""}]
[null,{"$f":"IF(Tabelle1!$T$3>0,HLOOKUP(Tabelle1!$T$3,Tabelle1!$B$112:$K$125,8),\"\")","v":""}]
[null,{"$f":"IF(Tabelle1!$T$3>0,HLOOKUP(Tabelle1!$T$3,Tabelle1!$B$112:$K$125,9),\"\")","v":""}]
[null,{"$f":"IF(Tabelle1!$T$3>0,HLOOKUP(Tabelle1!$T$3,Tabelle1!$B$112:$K$125,10),\"\")","v":""}]